{"text_format":"1","workbook":"xlsx","n_sheets":5,"sheets":["DADOS","INSUMOS","PO","CFF","ABC"],"not_rendered":{"charts":0,"images":18,"macros":1,"external_links":0,"defined_names":69,"comments":2,"pivot_tables":0},"unopened":[],"bounds":{"document_bytes":16777216,"sheet_cells":100000,"rows_first":2000,"rows_last":500,"rows_between":2000,"halvings":0,"cell_chars":16384,"cell_head_chars":4096},"cells_cut":0,"cells_raw":0,"read":"whole","date_system":"1900"}

{"sheet":"DADOS","index":0,"n_rows":147,"n_cols":24,"rows_kept":147,"cut":false,"hidden":false,"merged":[[35,0,35,23],[23,9,23,19],[8,0,8,23],[18,0,18,23],[10,0,10,23],[12,0,12,23],[23,0,23,1],[22,2,22,8],[23,2,23,8],[28,0,28,1],[14,0,14,23],[22,20,22,23],[20,0,20,23],[25,20,25,23],[33,6,33,9],[28,4,28,18],[49,0,49,23],[51,0,51,23],[50,0,50,23],[37,0,37,23],[38,0,38,23],[40,0,40,23],[45,0,45,23],[43,0,43,23],[57,0,57,23],[55,0,55,23],[56,0,56,23],[54,0,54,23],[144,0,144,4],[61,0,61,23],[63,0,63,23],[62,0,62,23],[64,0,64,23],[66,0,66,23],[146,1,146,4],[41,0,41,23],[34,0,34,23],[39,0,39,23],[145,7,145,10],[144,6,144,10],[58,0,58,23],[59,0,59,23],[67,0,67,23],[65,0,65,23],[47,0,47,23],[48,0,48,23],[68,0,68,23],[53,0,53,23],[46,0,46,23],[52,0,52,23],[29,4,29,18],[32,1,32,4],[0,1,1,23],[22,9,22,19],[22,0,22,1],[25,9,25,19],[26,20,26,23],[28,2,28,3],[4,0,4,23],[146,7,146,10],[23,20,23,23],[16,0,16,23],[29,0,29,1],[3,0,3,23],[6,0,6,23],[145,1,145,4],[32,6,32,9],[33,1,33,4],[60,0,60,23],[26,9,26,19],[25,0,25,8],[26,0,26,8],[31,0,31,4],[31,5,31,9],[29,2,29,3]]}
[null,"TRABALHO SOCIAL: PO - Planilha Orçamentária / CFF - Cronograma Físico Financeiro"]
[]
[]
["INSTRUÇÕES DE USO E PREENCHIMENTO"]
["(NÃO IMPRIMIR ESTA ABA)"]
[]
["1. Este documento somente pode ser utilizado nas versões do Excel 2003 ou superior. Não deve ser utilizado versões do BROffice. O Documento deve ser salvo SOMENTE em extensão habilitada para macros (.xls ou .xlsm). Se o documento for salvo na extensão .xlsx, o arquivo será INUTILIZADO. "]
[]
["2. Para funcionamento pleno desse arquivo, a Segurança de Macros do Excel deve ser habilitada."]
[]
{"$rows_left_out":138}
{"sheet":"INSUMOS","index":1,"n_rows":22,"n_cols":7,"rows_kept":22,"cut":false,"hidden":false,"merged":[[2,1,2,6]]}
[2]
[{"$f":"CHOOSE(A1,\"Rec. Humanos\",\"Rec. Materiais\",\"Serv. Terc.\")","v":"Rec. Materiais"}]
[{"$f":"MATCH(A2,OFFSET(Banco,0,1,,1),0)+ROW(Banco)+COUNTIF(OFFSET(Banco,0,1,,1),Banco.Opção)-1","v":18},"Banco de Insumos\n(Esta aba não precisa ser impressa)"]
[null,"TIPO","CÓDIGO","FONTE","DESCRIÇÃO","UNIDADE","CUSTO"]
[{"$f":"B5&\"-\"&C5","v":"-000"},null,{"$f":"TEXT(COUNTIF(OFFSET(Banco,1,1,ROW(C5)-ROW(Banco),1),B5),\"000\")","v":"000"}]
["Rec. Humanos-001","Rec. Humanos","001","CFESS","Mobilizador social (assitente social graduação)","H/t",157.29]
["Rec. Humanos-002","Rec. Humanos","002","CFESS","Assistente social (assistente social graduação)","H/t",157.29]
["Rec. Humanos-003","Rec. Humanos","003","CFESS","Analista pesquisa, consultor social (assistente social mestrado)","H/t",222.41]
["Rec. Humanos-004","Rec. Humanos","004","FIPE Salariômetro","Designer júnior (CBO 239435 - Designer educacional, RS)","H/t",49.48]
[{"$f":"B10&\"-\"&C10","v":"Rec. Humanos-005"},"Rec. Humanos",{"$f":"TEXT(COUNTIF(OFFSET(Banco,1,1,ROW(C10)-ROW(Banco),1),B10),\"000\")","v":"005"},"FIPE Salariômetro","Profissional da área de comunicação, relações públicas (CBO 142325 - Relações públicas)","H/t",35.42]
{"$rows_left_out":13}
{"sheet":"PO","index":2,"n_rows":102,"n_cols":27,"rows_kept":102,"cut":false,"hidden":false,"merged":[[92,10,94,20],[100,10,100,13],[97,10,97,13]]}
[null,null,null,null,null,null,null,null,null,null,null,null,null,null,"PO - PLANILHA ORÇAMENTÁRIA",null,null,null,null,null,"Grau de Sigilo"]
[null,"LOTE","Ação","AtivNível 1","AtivNível 2","AtivNível 3","Insumo",null,null,null,null,null,null,null,"TS - TRABALHO SOCIAL",null,null,null,null,null,"#PUBLICO"]
[]
["Nmax"]
[{"$f":"MAX($A$11:$A$91)","v":3}]
[]
[]
[]
["Nível","Altura","n1","n2","n3","n4","n5","Czero","Cnível","Nível","Item","Fonte","Tipo","Código","Descrição","Unidade","Quantidade","Custo Unitário (R$)","DI\n(%)","Preço Unitário (R$)","Preço Total\n(R$)",null,"Lista Crono","Concatenação Fonte-Código","BancoRef",null,"Valor DI"]
[{"$f":"CHOOSE(1+LOG(1+2*(J10=$C$2)+4*(J10=$D$2)+8*(J10=$E$2)+16*(J10=$F$2)+32*(J10=$G$2),2),0,1,2,3,4,\"S\")","v":"S"},{"$f":"IF(OR(A10=\"S\",A10=0),0,IF(ISERROR(I10),H10,SMALL(H10:I10,1)))","v":0},{"$f":"IF($A10=1,OFFSET(C10,-1,0)+1,OFFSET(C10,-1,0))","v":"n1"},{"$f":"IF($A10=1,0,IF($A10=2,OFFSET(D10,-1,0)+1,OFFSET(D10,-1,0)))","v":"n2"},{"$f":"IF(AND($A10<=2,$A10<>0),0,IF($A10=3,OFFSET(E10,-1,0)+1,OFFSET(E10,-1,0)))","v":"n3"},{"$f":"IF(AND($A10<=3,$A10<>0),0,IF($A10=4,OFFSET(F10,-1,0)+1,OFFSET(F10,-1,0)))","v":"n4"},{"$f":"IF(AND($A10<=4,$A10<>0),0,IF($A10=\"S\",OFFSET(G10,-1,0)+1,OFFSET(G10,-1,0)))","v":{"$error":"#VALUE!"}},{"$f":"IF(OR($A10=\"S\",$A10=0),0,MATCH(0,OFFSET($B10,1,$A10,ROW($A$91)-ROW($A10)),0))","v":0},{"$f":"IF(OR($A10=\"S\",$A10=0),0,MATCH(OFFSET($B10,0,$A10)+1,OFFSET($B10,1,$A10,ROW($A$91)-ROW($A10)),0))","v":0},"Insumo",{"$f":"IF($A10=0,\"-\",CONCATENATE(C10&\".\",IF(AND($A$5>=2,$A10>=2),D10&\".\",\"\"),IF(AND($A$5>=3,$A10>=3),E10&\".\",\"\"),IF(AND($A$5>=4,$A10>=4),F10&\".\",\"\"),IF($A10=\"S\",G10&\".\",\"\")))","v":{"$error":"#VALUE!"}},{"$f":"IF(NOT(ISERROR($Y10)),IF($Y10<>FALSE,INDEX(Banco,$Y10,4),\"\"),\"\")","v":""},null,null,{"$f":"IF(NOT(ISERROR($Y10)),IF($Y10<>FALSE,INDEX(Banco,$Y10,5),\"\"),\"\")","v":""},{"$f":"IF(NOT(ISERROR($Y10)),IF($Y10<>FALSE,INDEX(Banco,$Y10,6),\"\"),\"\")","v":""},null,{"$f":"IF(NOT(ISERROR($Y10)),IF($Y10<>FALSE,INDEX(Banco,$Y10,7),0),0)","v":0},"DI 1",{"$f":"IF($J10=$G$2,ROUND(ROUND($R10,2)*IF($R$9=\"Preço Unitário (R$)\",1,1+$AA10),2),0)","v":0},{"$f":"IF($A10=\"S\",VTOTAL1,IF($A10=0,0,ROUND(SomaAgrup,2)))","v":0},null,{"$f":"IF(OR($A10=0,$A10=\"S\",$A10>CFF!$A$9),\"\",MAX(W$11:OFFSET(W10,-1,0))+1)","v":""},{"$f":"IF(AND($J10=$G$2,$N10<>\"\",$M10<>\"\"),CONCATENATE($M10,\"-\",$N10))","v":false},{"$f":"IF(X10<>FALSE,MATCH(X10,OFFSET(Banco,0,0,,1),0))","v":false},null,{"$f":"IF($J10=$G$2,ROUND(IF(ISNUMBER(S10),S10,IF(LEFT(S10,2)=\"DI\",HLOOKUP(S10,DADOS!$T$29:$X$30,2,FALSE),0)),4),\"\")","v":0.25}]
{"$rows_left_out":93}
{"sheet":"CFF","index":3,"n_rows":93,"n_cols":40,"rows_kept":93,"cut":false,"hidden":false,"merged":[[10,12,12,12],[91,11,91,13],[7,11,7,12],[10,13,12,13],[10,11,12,11],[13,11,16,12],[13,13,16,13],[17,11,19,11],[17,12,19,12],[17,13,19,13],[20,11,22,11],[20,12,22,12],[20,13,22,13],[23,11,25,11],[23,12,25,12],[23,13,25,13],[26,11,28,11],[26,12,28,12],[26,13,28,13],[29,11,31,11],[29,12,31,12],[29,13,31,13],[32,11,34,11],[32,12,34,12],[32,13,34,13],[35,11,37,11],[35,12,37,12],[35,13,37,13],[38,11,40,11],[38,12,40,12],[38,13,40,13],[41,11,43,11],[41,12,43,12],[41,13,43,13],[44,11,46,11],[44,12,46,12],[44,13,46,13],[47,11,49,11],[47,12,49,12],[47,13,49,13],[50,11,52,11],[50,12,52,12],[50,13,52,13],[53,11,55,11],[53,12,55,12],[53,13,55,13],[56,11,58,11],[56,12,58,12],[56,13,58,13],[59,11,61,11],[59,12,61,12],[59,13,61,13],[62,11,64,11],[62,12,64,12],[62,13,64,13],[65,11,67,11],[65,12,67,12],[65,13,67,13],[68,11,70,11],[68,12,70,12],[68,13,70,13],[71,11,73,11],[71,12,73,12],[71,13,73,13],[74,11,76,11],[74,12,76,12],[74,13,76,13],[77,11,79,11],[77,12,79,12],[77,13,79,13],[88,32,88,34],[89,32,89,34],[88,11,88,13],[89,12,89,13],[90,32,90,34],[88,24,88,26],[89,24,89,26],[90,24,90,26],[90,16,90,18],[90,12,90,13],[89,16,89,18],[88,16,88,18],[80,11,82,11],[80,12,82,12],[80,13,82,13],[83,11,85,11],[83,12,85,12],[83,13,85,13]]}
[null,null,null,null,null,null,null,null,null,null,null,null,null,null,"    CFF -","CRONOGRAMA FÍSICO-FINANCEIRO",null,null,null,null,null,null,null,"CRONOGRAMA FÍSICO-FINANCEIRO",null,null,null,null,null,null,null,"CRONOGRAMA FÍSICO-FINANCEIRO"]
[null,null,null,null,null,null,null,null,null,null,null,null,null,null,"TS -","TRABALHO SOCIAL",null,null,null,null,null,null,null,"TRABALHO SOCIAL",null,null,null,null,null,null,null,"TRABALHO SOCIAL"]
[]
[]
[]
[]
[]
["Nível Máx Crono",null,null,null,null,null,null,null,null,null,null,{"$f":"IF(MAX($A$14:$A$88)<>MAX(PO!$W$11:$W$91),\"ERRO: CRONOGRAMA DESATUALIZADO\",IF(OR(COUNTIF($O$16:$AN$16,\">1\")>0,OFFSET($AN$17,0,-1)<>$N$14),\"ERRO: CRONOGRAMA NÃO FECHA EM 100%\",\"\"))","v":""},null,{"$f":"IF(TipoOrçamento=\"REPROGRAMADOAC\",\"Qtde de Medições realizadas\",\"\")","v":""}]
[3,null,null,null,null,null,null,null,null,null,null,null,null,1,{"$f":"IF(AND(TipoOrçamento=\"REPROGRAMADOAC\",$N$9>0),$N$9-1,0)","v":0},{"$f":"OFFSET(P9,0,-1)+1","v":1},{"$f":"OFFSET(Q9,0,-1)+1","v":2},3,4,5,6,7,8,{"$f":"OFFSET(X9,0,-1)+1","v":9},10,11,12,13,14,15,16,{"$f":"OFFSET(AF9,0,-1)+1","v":17},18,19,20,21,22,23,24]
["Lista Crono","Último Nível","Nível","Altura","N1","N2","N3","N4","Czero","Cnível","VTOTAL SOMA","Item","Descrição das Atividades","Valores Totais (R$)",{"$f":"\"Início do TS\"&CHAR(10)&TEXT(DADOS!C30,\"dd/mm/aa\")","v":"Início do TS\n01/09/22"},{"$f":"IF(AND(TipoOrçamento=\"REPROGRAMADOAC\",$N$9>0,N10=\"Valores Totais (R$)\"),\"Parcela \"&$N$9&\" Executado\",\"Parcela \"&P$9&CHAR(10)&TEXT(DATE(YEAR(DADOS!$C$30),MONTH(DADOS!$C$30)-1+P$9-IF(AND(TipoOrçamento=\"REPROGRAMADOAC\",$N$9>0),$N$9,0),1),\"mmm/aa\"))","v":"Parcela 1\nset/22"},{"$f":"IF(AND(TipoOrçamento=\"REPROGRAMADOAC\",$N$9>0,O10=\"Valores Totais (R$)\"),\"Parcela \"&$N$9&\" Executado\",\"Parcela \"&Q$9&CHAR(10)&TEXT(DATE(YEAR(DADOS!$C$30),MONTH(DADOS!$C$30)-1+Q$9-IF(AND(TipoOrçamento=\"REPROGRAMADOAC\",$N$9>0),$N$9,0),1),\"mmm/aa\"))","v":"Parcela 2\nout/22"},{"$f":"IF(AND(TipoOrçamento=\"REPROGRAMADOAC\",$N$9>0,P10=\"Valores Totais (R$)\"),\"Parcela \"&$N$9&\" Executado\",\"Parcela \"&R$9&CHAR(10)&TEXT(DATE(YEAR(DADOS!$C$30),MONTH(DADOS!$C$30)-1+R$9-IF(AND(TipoOrçamento=\"REPROGRAMADOAC\",$N$9>0),$N$9,0),1),\"mmm/aa\"))","v":"Parcela 3\nnov/22"},{"$f":"IF(AND(TipoOrçamento=\"REPROGRAMADOAC\",$N$9>0,Q10=\"Valores Totais (R$)\"),\"Parcela \"&$N$9&\" Executado\",\"Parcela \"&S$9&CHAR(10)&TEXT(DATE(YEAR(DADOS!$C$30),MONTH(DADOS!$C$30)-1+S$9-IF(AND(TipoOrçamento=\"REPROGRAMADOAC\",$N$9>0),$N$9,0),1),\"mmm/aa\"))","v":"Parcela 4\ndez/22"},{"$f":"IF(AND(TipoOrçamento=\"REPROGRAMADOAC\",$N$9>0,R10=\"Valores Totais (R$)\"),\"Parcela \"&$N$9&\" Executado\",\"Parcela \"&T$9&CHAR(10)&TEXT(DATE(YEAR(DADOS!$C$30),MONTH(DADOS!$C$30)-1+T$9-IF(AND(TipoOrçamento=\"REPROGRAMADOAC\",$N$9>0),$N$9,0),1),\"mmm/aa\"))","v":"Parcela 5\njan/23"},{"$f":"IF(AND(TipoOrçamento=\"REPROGRAMADOAC\",$N$9>0,S10=\"Valores Totais (R$)\"),\"Parcela \"&$N$9&\" Executado\",\"Parcela \"&U$9&CHAR(10)&TEXT(DATE(YEAR(DADOS!$C$30),MONTH(DADOS!$C$30)-1+U$9-IF(AND(TipoOrçamento=\"REPROGRAMADOAC\",$N$9>0),$N$9,0),1),\"mmm/aa\"))","v":"Parcela 6\nfev/23"},{"$f":"IF(AND(TipoOrçamento=\"REPROGRAMADOAC\",$N$9>0,T10=\"Valores Totais (R$)\"),\"Parcela \"&$N$9&\" Executado\",\"Parcela \"&V$9&CHAR(10)&TEXT(DATE(YEAR(DADOS!$C$30),MONTH(DADOS!$C$30)-1+V$9-IF(AND(TipoOrçamento=\"REPROGRAMADOAC\",$N$9>0),$N$9,0),1),\"mmm/aa\"))","v":"Parcela 7\nmar/23"},{"$f":"IF(AND(TipoOrçamento=\"REPROGRAMADOAC\",$N$9>0,U10=\"Valores Totais (R$)\"),\"Parcela \"&$N$9&\" Executado\",\"Parcela \"&W$9&CHAR(10)&TEXT(DATE(YEAR(DADOS!$C$30),MONTH(DADOS!$C$30)-1+W$9-IF(AND(TipoOrçamento=\"REPROGRAMADOAC\",$N$9>0),$N$9,0),1),\"mmm/aa\"))","v":"Parcela 8\nabr/23"},{"$f":"IF(AND(TipoOrçamento=\"REPROGRAMADOAC\",$N$9>0,V10=\"Valores Totais (R$)\"),\"Parcela \"&$N$9&\" Executado\",\"Parcela \"&X$9&CHAR(10)&TEXT(DATE(YEAR(DADOS!$C$30),MONTH(DADOS!$C$30)-1+X$9-IF(AND(TipoOrçamento=\"REPROGRAMADOAC\",$N$9>0),$N$9,0),1),\"mmm/aa\"))","v":"Parcela 9\nmai/23"},{"$f":"IF(AND(TipoOrçamento=\"REPROGRAMADOAC\",$N$9>0,W10=\"Valores Totais (R$)\"),\"Parcela \"&$N$9&\" Executado\",\"Parcela \"&Y$9&CHAR(10)&TEXT(DATE(YEAR(DADOS!$C$30),MONTH(DADOS!$C$30)-1+Y$9-IF(AND(TipoOrçamento=\"REPROGRAMADOAC\",$N$9>0),$N$9,0),1),\"mmm/aa\"))","v":"Parcela 10\njun/23"},{"$f":"IF(AND(TipoOrçamento=\"REPROGRAMADOAC\",$N$9>0,X10=\"Valores Totais (R$)\"),\"Parcela \"&$N$9&\" Executado\",\"Parcela \"&Z$9&CHAR(10)&TEXT(DATE(YEAR(DADOS!$C$30),MONTH(DADOS!$C$30)-1+Z$9-IF(AND(TipoOrçamento=\"REPROGRAMADOAC\",$N$9>0),$N$9,0),1),\"mmm/aa\"))","v":"Parcela 11\njul/23"},{"$f":"IF(AND(TipoOrçamento=\"REPROGRAMADOAC\",$N$9>0,Y10=\"Valores Totais (R$)\"),\"Parcela \"&$N$9&\" Executado\",\"Parcela \"&AA$9&CHAR(10)&TEXT(DATE(YEAR(DADOS!$C$30),MONTH(DADOS!$C$30)-1+AA$9-IF(AND(TipoOrçamento=\"REPROGRAMADOAC\",$N$9>0),$N$9,0),1),\"mmm/aa\"))","v":"Parcela 12\nago/23"},{"$f":"IF(AND(TipoOrçamento=\"REPROGRAMADOAC\",$N$9>0,Z10=\"Valores Totais (R$)\"),\"Parcela \"&$N$9&\" Executado\",\"Parcela \"&AB$9&CHAR(10)&TEXT(DATE(YEAR(DADOS!$C$30),MONTH(DADOS!$C$30)-1+AB$9-IF(AND(TipoOrçamento=\"REPROGRAMADOAC\",$N$9>0),$N$9,0),1),\"mmm/aa\"))","v":"Parcela 13\nset/23"},{"$f":"IF(AND(TipoOrçamento=\"REPROGRAMADOAC\",$N$9>0,AA10=\"Valores Totais (R$)\"),\"Parcela \"&$N$9&\" Executado\",\"Parcela \"&AC$9&CHAR(10)&TEXT(DATE(YEAR(DADOS!$C$30),MONTH(DADOS!$C$30)-1+AC$9-IF(AND(TipoOrçamento=\"REPROGRAMADOAC\",$N$9>0),$N$9,0),1),\"mmm/aa\"))","v":"Parcela 14\nout/23"},{"$f":"IF(AND(TipoOrçamento=\"REPROGRAMADOAC\",$N$9>0,AB10=\"Valores Totais (R$)\"),\"Parcela \"&$N$9&\" Executado\",\"Parcela \"&AD$9&CHAR(10)&TEXT(DATE(YEAR(DADOS!$C$30),MONTH(DADOS!$C$30)-1+AD$9-IF(AND(TipoOrçamento=\"REPROGRAMADOAC\",$N$9>0),$N$9,0),1),\"mmm/aa\"))","v":"Parcela 15\nnov/23"},{"$f":"IF(AND(TipoOrçamento=\"REPROGRAMADOAC\",$N$9>0,AC10=\"Valores Totais (R$)\"),\"Parcela \"&$N$9&\" Executado\",\"Parcela \"&AE$9&CHAR(10)&TEXT(DATE(YEAR(DADOS!$C$30),MONTH(DADOS!$C$30)-1+AE$9-IF(AND(TipoOrçamento=\"REPROGRAMADOAC\",$N$9>0),$N$9,0),1),\"mmm/aa\"))","v":"Parcela 16\ndez/23"},{"$f":"IF(AND(TipoOrçamento=\"REPROGRAMADOAC\",$N$9>0,AD10=\"Valores Totais (R$)\"),\"Parcela \"&$N$9&\" Executado\",\"Parcela \"&AF$9&CHAR(10)&TEXT(DATE(YEAR(DADOS!$C$30),MONTH(DADOS!$C$30)-1+AF$9-IF(AND(TipoOrçamento=\"REPROGRAMADOAC\",$N$9>0),$N$9,0),1),\"mmm/aa\"))","v":"Parcela 17\njan/24"},{"$f":"IF(AND(TipoOrçamento=\"REPROGRAMADOAC\",$N$9>0,AE10=\"Valores Totais (R$)\"),\"Parcela \"&$N$9&\" Executado\",\"Parcela \"&AG$9&CHAR(10)&TEXT(DATE(YEAR(DADOS!$C$30),MONTH(DADOS!$C$30)-1+AG$9-IF(AND(TipoOrçamento=\"REPROGRAMADOAC\",$N$9>0),$N$9,0),1),\"mmm/aa\"))","v":"Parcela 18\nfev/24"},{"$f":"IF(AND(TipoOrçamento=\"REPROGRAMADOAC\",$N$9>0,AF10=\"Valores Totais (R$)\"),\"Parcela \"&$N$9&\" Executado\",\"Parcela \"&AH$9&CHAR(10)&TEXT(DATE(YEAR(DADOS!$C$30),MONTH(DADOS!$C$30)-1+AH$9-IF(AND(TipoOrçamento=\"REPROGRAMADOAC\",$N$9>0),$N$9,0),1),\"mmm/aa\"))","v":"Parcela 19\nmar/24"},{"$f":"IF(AND(TipoOrçamento=\"REPROGRAMADOAC\",$N$9>0,AG10=\"Valores Totais (R$)\"),\"Parcela \"&$N$9&\" Executado\",\"Parcela \"&AI$9&CHAR(10)&TEXT(DATE(YEAR(DADOS!$C$30),MONTH(DADOS!$C$30)-1+AI$9-IF(AND(TipoOrçamento=\"REPROGRAMADOAC\",$N$9>0),$N$9,0),1),\"mmm/aa\"))","v":"Parcela 20\nabr/24"},{"$f":"IF(AND(TipoOrçamento=\"REPROGRAMADOAC\",$N$9>0,AH10=\"Valores Totais (R$)\"),\"Parcela \"&$N$9&\" Executado\",\"Parcela \"&AJ$9&CHAR(10)&TEXT(DATE(YEAR(DADOS!$C$30),MONTH(DADOS!$C$30)-1+AJ$9-IF(AND(TipoOrçamento=\"REPROGRAMADOAC\",$N$9>0),$N$9,0),1),\"mmm/aa\"))","v":"Parcela 21\nmai/24"},{"$f":"IF(AND(TipoOrçamento=\"REPROGRAMADOAC\",$N$9>0,AI10=\"Valores Totais (R$)\"),\"Parcela \"&$N$9&\" Executado\",\"Parcela \"&AK$9&CHAR(10)&TEXT(DATE(YEAR(DADOS!$C$30),MONTH(DADOS!$C$30)-1+AK$9-IF(AND(TipoOrçamento=\"REPROGRAMADOAC\",$N$9>0),$N$9,0),1),\"mmm/aa\"))","v":"Parcela 22\njun/24"},{"$f":"IF(AND(TipoOrçamento=\"REPROGRAMADOAC\",$N$9>0,AJ10=\"Valores Totais (R$)\"),\"Parcela \"&$N$9&\" Executado\",\"Parcela \"&AL$9&CHAR(10)&TEXT(DATE(YEAR(DADOS!$C$30),MONTH(DADOS!$C$30)-1+AL$9-IF(AND(TipoOrçamento=\"REPROGRAMADOAC\",$N$9>0),$N$9,0),1),\"mmm/aa\"))","v":"Parcela 23\njul/24"},{"$f":"IF(AND(TipoOrçamento=\"REPROGRAMADOAC\",$N$9>0,AK10=\"Valores Totais (R$)\"),\"Parcela \"&$N$9&\" Executado\",\"Parcela \"&AM$9&CHAR(10)&TEXT(DATE(YEAR(DADOS!$C$30),MONTH(DADOS!$C$30)-1+AM$9-IF(AND(TipoOrçamento=\"REPROGRAMADOAC\",$N$9>0),$N$9,0),1),\"mmm/aa\"))","v":"Parcela 24\nago/24"}]
{"$rows_left_out":84}
{"sheet":"ABC","index":4,"n_rows":21,"n_cols":25,"rows_kept":21,"cut":false,"hidden":true,"merged":[[12,1,12,20],[17,1,17,4],[18,16,18,20],[19,17,19,20],[20,17,20,20],[18,1,18,4],[13,1,15,20]]}
["Orçamento",null,null,null,"ANEXO - ANÁLISE PLANILHA ORÇAMENTÁRIA",null,null,null,null,null,null,null,null,null,null,null,null,null,null,null,null,null,null,null,"Grau de Sigilo"]
["Curva ABC",null,null,null,"CURVA ABC",null,null,null,null,null,null,null,null,null,null,null,null,null,null,null,null,null,null,null,"#CONFIDENCIAL 05"]
[1]
["Todos"]
["Significativos"]
[1]
[1,null,null,null,null,null,null,null,null,null,null,"Total:",{"$f":"SUMIF(OFFSET($S$10,1,0,$A$7),TRUE,OFFSET($M$10,1,0,$A$7))","v":0},{"$f":"M7","v":0},null,null,"Análise:",0.8]
[0,{"$f":"MATCH(B10,OFFSET(Import.PO,-3,0,1),0)","v":1},2,3,4,5,6,7,null,8,17,10,11,null,null,null,{"$f":"SMALL(OFFSET($R$10,1,0,$A$7),1+COUNTIF(OFFSET($R$10,1,0,$A$7),\"<\"&PARETO))","v":{"$error":"#NUM!"}}]
[{"$f":"ROW(A9)-ROW($A$10)","v":-1},{"$f":"IF($A9<=$A$8,INDEX(Import.PO,$A9,B$8),0)","v":{"$error":"#VALUE!"}},{"$error":"#VALUE!"},{"$error":"#VALUE!"},{"$error":"#VALUE!"},{"$error":"#VALUE!"},{"$error":"#VALUE!"},{"$error":"#VALUE!"},{"$f":"IF($P9=ROW($P9)-ROW($P$10),SUMIF(OFFSET($P$10,1,0,$A$7),$P9,OFFSET($H$10,1,0,$A$7)),OFFSET($I$10,$P9,0))","v":{"$error":"#VALUE!"}},{"$f":"IF($A9<=$A$8,INDEX(Import.PO,$A9,J$8),0)","v":{"$error":"#VALUE!"}},{"$f":"IF($A9<=$A$8,INDEX(Import.PO,$A9,K$8),0)","v":{"$error":"#VALUE!"}},{"$f":"IF($A9<=$A$8,INDEX(Import.PO,$A9,L$8),0)","v":{"$error":"#VALUE!"}},{"$f":"IF($A9<=$A$8,INDEX(Import.PO,$A9,M$8),0)","v":{"$error":"#VALUE!"}},{"$f":"IF($P9=ROW($P9)-ROW($P$10),SUMIF(OFFSET($P$10,1,0,$A$7),$P9,OFFSET($M$10,1,0,$A$7)),OFFSET($N$10,$P9,0))","v":{"$error":"#VALUE!"}},{"$f":"IF($S9,D9&\"-\"&E9,\"\")","v":{"$error":"#VALUE!"}},{"$f":"IF($S9,MATCH(O9,OFFSET($O$10,1,0,$A$7),0),\"\")","v":{"$error":"#VALUE!"}},{"$f":"IF($P9=ROW($P9)-ROW($P$10),$N9/$M$7,IF(ISNUMBER($P9),TEXT(OFFSET($Q$10,$P9,0),\" 0,00% \"),0))","v":{"$error":"#VALUE!"}},{"$f":"SUMIF(OFFSET($Q$10,1,0,$A$7),\">=\"&$N9/$M$7,OFFSET($Q$10,1,0,$A$7))","v":0},{"$f":"E9<>0","v":{"$error":"#VALUE!"}},{"$f":"IF($P9=ROW($P9)-ROW($P$10),R9<=$Q$8,IF(ISNUMBER($P9),OFFSET($T$10,VALUE($P9),0),FALSE))","v":{"$error":"#VALUE!"}}]
["Linha Orç","Item","Fonte","Tipo","Código","Descrição","Unidade","Quantidade","Qtde Agrupada","Custo Unitário (R$)","Valor DI","Preço Unitário (R$)","Preço Total\n(R$)","Preço Total (R$)","Fonte","Primeira linha","Peso Agrupado","Peso Acum.","Item","Significativo","Análise"]
{"$rows_left_out":11}